BDBM50528941 CHEMBL4470361
SMILES Nc1nc2[nH]cc(Cc3ccc(cc3)C(=O)Nc3cccc(c3)C(O)=O)c2c(=O)[nH]1
InChI Key InChIKey=JNRSKWXVEYVQFX-UHFFFAOYSA-N
Data  2 IC50
  Tab Delimited (TSV)   2D SDfile   Computed 3D by Vconf -m prep SDfile
Find this compound or compounds like it in BindingDB:
Activity Spreadsheet -- Enzyme Inhibition Constant Data from BindingDB
Found 2 hits for monomerid = 50528941
TargetPolyunsaturated fatty acid lipoxygenase ALOX15B(Rattus norvegicus)
Yale University
Curated by ChEMBL
LigandPNGBDBM50528941(CHEMBL4470361)
Affinity DataIC50:  130nM. Assay description: Inhibition of recombinant human His6-tagged TS using dUMP and 5,10-methylenetetrahydrofolate as substrate by spectrometry
Ligand InfoPC cidPC sid
In DepthDetails ArticlePubMed
TargetBifunctional dihydrofolate reductase-thymidylate synthase(Cryptosporidium hominis)
Yale University
Curated by ChEMBL
LigandPNGBDBM50528941(CHEMBL4470361)
Affinity DataIC50:  9.60E+4nM. Assay description: Inhibition of recombinant Cryptosporidium hominis TS-DHFR expresssed in Escherichia coli PA414 using dUMP and 5,10-methylenetetrahydrofolate as subst...
Ligand InfoPC cidPC sid
In DepthDetails ArticlePubMed