BDBM50529191 CHEMBL4564380
SMILES CCOC(=O)c1ccccc1N\N=C(/C(O)=O)C(=O)C(F)(F)F
InChI Key InChIKey=FKOIGOOOYIIWID-NVMNQCDNSA-N
Data  1 IC50
  Tab Delimited (TSV)   2D SDfile   Computed 3D by Vconf -m prep SDfile
Find this compound or compounds like it in BindingDB:
Activity Spreadsheet -- Enzyme Inhibition Constant Data from BindingDB
Found 1 hit for monomerid = 50529191
TargetLiver carboxylesterase(Sus scrofa)
Ural Branch Of Russian Academy Of Sciences
Curated by ChEMBL
LigandPNGBDBM50529191(CHEMBL4564380)
Affinity DataIC50:  70nM. Assay description: Inhibition of porcine liver carboxylesterase using 4-NPA as substrate preincubated for 10 mins followed by substrate addition by spectrophotometric a...
Ligand InfoPC cidPC sid
In DepthDetails ArticlePubMed