BDBM50529381 CHEMBL4446120
SMILES COc1c(cc(Cl)c(C)c1-c1cncc(c1)S(C)(=O)=O)[C@H](C)Nc1ncnc2[nH]cnc12
InChI Key InChIKey=MRVUSKQUDBSIOO-LBPRGKRZSA-N
Data  1 IC50
  Tab Delimited (TSV)   2D SDfile   Computed 3D by Vconf -m prep SDfile
Find this compound or compounds like it in BindingDB:
Activity Spreadsheet -- Enzyme Inhibition Constant Data from BindingDB
Found 1 hit for monomerid = 50529381
LigandPNGBDBM50529381(CHEMBL4446120)
Affinity DataIC50:  1.70nM. Assay description: Inhibition of PI3Kdelta (unknown origin) using D-myophosphatidylinositol 4,5-bisphosphate as substrate incubated for 120 mins by [gamma-33P]ATP based...
Ligand InfoKEGGPC cidPC sid
In DepthDetails ArticlePubMed