BDBM50529391 CHEMBL4513857
SMILES COc1c(cc(Cl)c(C)c1-c1cnn(C)c1)[C@H](C)Nc1ncnc2[nH]cnc12
InChI Key InChIKey=VOJPLGPNKZQWGM-NSHDSACASA-N
Data  1 IC50
  Tab Delimited (TSV)   2D SDfile   Computed 3D by Vconf -m prep SDfile
Find this compound or compounds like it in BindingDB:
Activity Spreadsheet -- Enzyme Inhibition Constant Data from BindingDB
Found 1 hit for monomerid = 50529391
LigandPNGBDBM50529391(CHEMBL4513857)
Affinity DataIC50:  2.80nM. Assay description: Inhibition of PI3Kdelta (unknown origin) using D-myophosphatidylinositol 4,5-bisphosphate as substrate incubated for 120 mins by [gamma-33P]ATP based...
Ligand InfoKEGGPC cidPC sid
In DepthDetails ArticlePubMed