BDBM50529544 CHEMBL4557484
SMILES COc1nc(Nc2cc(ccc2N[C@@H](c2cccc(Cl)c2F)c2ncccc2F)S(C)(=O)=O)nc(OC)n1
InChI Key InChIKey=VRRUOTAOJPJOKB-FQEVSTJZSA-N
Data  1 IC50
  Tab Delimited (TSV)   2D SDfile   Computed 3D by Vconf -m prep SDfile
Find this compound or compounds like it in BindingDB:
Activity Spreadsheet -- Enzyme Inhibition Constant Data from BindingDB
Found 1 hit for monomerid = 50529544
TargetHistone-lysine N-methyltransferase, H3 lysine-79 specific(Homo sapiens (Human))
Novartis Institutes For Biomedical Research
Curated by ChEMBL
LigandPNGBDBM50529544(CHEMBL4557484)
Affinity DataIC50:  0.590nM. Assay description: Inhibition of 0.05 nM DOT1L (2 to 416 residues) (unknown origin) using biotinylated nucleosome as substrate and [3H]SAM as co-factor preincubated for...
Ligand InfoPC cidPC sid
In DepthDetails ArticlePubMed