BDBM50530172 CHEMBL4547323
SMILES Fc1ccc(cc1)S(=O)(=O)NCCNC(=O)CCc1ccc(cc1)-c1cnc2[nH]ccc2c1
InChI Key InChIKey=FBBZYQXPSQBBCZ-UHFFFAOYSA-N
Data  2 IC50
  Tab Delimited (TSV)   2D SDfile   Computed 3D by Vconf -m prep SDfile
Find this compound or compounds like it in BindingDB:
Activity Spreadsheet -- Enzyme Inhibition Constant Data from BindingDB
Found 2 hits for monomerid = 50530172
TargetReceptor-type tyrosine-protein kinase FLT3(Homo sapiens (Human))
Leiden University
Curated by ChEMBL
LigandPNGBDBM50530172(CHEMBL4547323)
Affinity DataIC50:  0.407nM. Assay description: Inhibition of recombinant human N-terminal GST/His6-fused FLT3 ITD mutant (R571 to S993 residues) expressed in Sf9 insect cells assessed as residual ...
Ligand InfoPC cidPC sid
In DepthDetails ArticlePubMed
TargetReceptor-type tyrosine-protein kinase FLT3(Homo sapiens (Human))
Leiden University
Curated by ChEMBL
LigandPNGBDBM50530172(CHEMBL4547323)
Affinity DataIC50:  0.407nM. Assay description: Inhibition of recombinant human N-terminal GST/His6-fused FLT3 ITD mutant (R571 to S993 residues) expressed in Sf9 insect cells assessed as residual ...
Ligand InfoPC cidPC sid
In DepthDetails ArticlePubMed