BDBM50530411 CHEMBL4573126
SMILES CCCC[C@H](NC(=O)[C@@H](NC(=O)[C@@H](NC(=O)[C@H](Cc1ccc(O)cc1)NC(=O)[C@H](Cc1ccccc1)NC(=O)[C@H](CCCNC(N)=N)N(C)C(C)=O)C(C)C)C(C)C)C(=O)N[C@@H](Cc1c[nH]c2ccccc12)C(=O)N[C@@H](CCCCN)C(N)=O
InChI Key InChIKey=MLZQNNDQWVROFC-HTSIWFDASA-N
Data  2 Kd
  Tab Delimited (TSV)   2D SDfile   Computed 3D by Vconf -m prep SDfile
Find this compound or compounds like it in BindingDB:
Activity Spreadsheet -- Enzyme Inhibition Constant Data from BindingDB
Found 2 hits for monomerid = 50530411
TargetLeukocyte surface antigen CD47(Homo sapiens (Human))
Sorbonne Universit£
Curated by ChEMBL
LigandPNGBDBM50530411(CHEMBL4573126)
Affinity DataKd:  2.00E+4nM. Assay description: Binding affinity to CD47 in biotinylated human MEC1 cell membranes by biolayer interferometry
Ligand InfoPC cidPC sid
In DepthDetails ArticlePubMed
TargetLeukocyte surface antigen CD47(Homo sapiens (Human))
Sorbonne Universit£
Curated by ChEMBL
LigandPNGBDBM50530411(CHEMBL4573126)
Affinity DataKd:  2.00E+4nM. Assay description: Binding affinity to CD47 in biotinylated human MEC1 cell membranes by biolayer interferometry
Ligand InfoPC cidPC sid
In DepthDetails ArticlePubMed