BDBM50530534 CHEMBL4445144::US11174268, Example 331
SMILES COc1ccc(F)c(c1)[C@H](C)Nc1cc(F)c(cc1Cl)S(=O)(=O)Nc1cscn1
InChI Key InChIKey=YURAPCXMUFFHQV-JTQLQIEISA-N
Data  7 IC50  2 EC50
  Tab Delimited (TSV)   2D SDfile   Computed 3D by Vconf -m prep SDfile
Find this compound or compounds like it in BindingDB:
Activity Spreadsheet -- Enzyme Inhibition Constant Data from BindingDB
Found 9 hits for monomerid = 50530534
TargetNuclear receptor subfamily 1 group I member 2(Homo sapiens (Human))
Xenon Pharmaceuticals
Curated by ChEMBL
LigandPNGBDBM50530534(CHEMBL4445144 | US11174268, Example 331)
Affinity DataEC50:  1.68E+3nM. Assay description: Agonist activity at PXR in human DPX2 cells after 24 hrs by luciferase reporter gene assay
Ligand InfoPC cidPC sid
In DepthDetails ArticlePubMed
TargetSodium channel protein type 8 subunit alpha/subunit beta-1(Homo sapiens (Human))
Xenon Pharmaceuticals
Curated by ChEMBL
LigandPNGBDBM50530534(CHEMBL4445144 | US11174268, Example 331)
Affinity DataIC50:  110nM. Assay description: Inhibition of recombinant human full length Nav1.6 co-expressed with human SCN1B in HEK293 cells measured after 20 mins at -45 mV holding potential b...
Ligand InfoPC cidPC sid
In DepthDetails ArticlePubMed
TargetSodium channel protein type 8 subunit alpha/subunit beta-1(Homo sapiens (Human))
Xenon Pharmaceuticals
Curated by ChEMBL
LigandPNGBDBM50530534(CHEMBL4445144 | US11174268, Example 331)
Affinity DataIC50:  110nM. Assay description: Inhibition of recombinant human full length Nav1.6 co-expressed with human SCN1B in HEK293 cells measured after 20 mins at -45 mV holding potential b...
Ligand InfoPC cidPC sid
In DepthDetails ArticlePubMed
TargetNuclear receptor subfamily 1 group I member 2(Homo sapiens (Human))
Xenon Pharmaceuticals
Curated by ChEMBL
LigandPNGBDBM50530534(CHEMBL4445144 | US11174268, Example 331)
Affinity DataEC50:  1.68E+3nM. Assay description: Agonist activity at PXR in human DPX2 cells after 24 hrs by luciferase reporter gene assay
Ligand InfoPC cidPC sid
In DepthDetails ArticlePubMed
TargetSodium channel protein type 1 subunit alpha(Homo sapiens (Human))
Xenon Pharmaceuticals
US Patent
LigandPNGBDBM50530534(CHEMBL4445144 | US11174268, Example 331)
Affinity DataIC50:  1.00E+4nM. Assay description: Patch voltage clamp electrophysiology allows for the direct measurement and quantification of block of voltage-gated sodium channels (NaV's), and...
Ligand InfoPC cidPC sid
In DepthDetails US Patent
TargetSodium channel protein type 8 subunit alpha(Homo sapiens (Human))
Xenon Pharmaceuticals
US Patent
LigandPNGBDBM50530534(CHEMBL4445144 | US11174268, Example 331)
Affinity DataIC50:  99nM. Assay description: Patch voltage clamp electrophysiology allows for the direct measurement and quantification of block of voltage-gated sodium channels (NaV's), and...
Ligand InfoPC cidPC sid
In DepthDetails US Patent
TargetSodium channel protein type 5 subunit alpha(Homo sapiens (Human))
Xenon Pharmaceuticals
US Patent
LigandPNGBDBM50530534(CHEMBL4445144 | US11174268, Example 331)
Affinity DataIC50:  1.13E+4nM. Assay description: This sodium influx assay employs the use of the cell permeable, sodium sensitive dye ANG2 to quantify sodium ion influx through sodium channels which...
Ligand InfoPC cidPC sid
In DepthDetails US Patent
TargetSodium channel protein type 1 subunit alpha(Homo sapiens (Human))
Xenon Pharmaceuticals
US Patent
LigandPNGBDBM50530534(CHEMBL4445144 | US11174268, Example 331)
Affinity DataIC50:  7.88E+3nM. Assay description: This sodium influx assay employs the use of the cell permeable, sodium sensitive dye ANG2 to quantify sodium ion influx through sodium channels which...
Ligand InfoPC cidPC sid
In DepthDetails US Patent
TargetSodium channel protein type 8 subunit alpha(Homo sapiens (Human))
Xenon Pharmaceuticals
US Patent
LigandPNGBDBM50530534(CHEMBL4445144 | US11174268, Example 331)
Affinity DataIC50:  724nM. Assay description: This sodium influx assay employs the use of the cell permeable, sodium sensitive dye ANG2 to quantify sodium ion influx through sodium channels which...
Ligand InfoPC cidPC sid
In DepthDetails US Patent