BDBM50530542 CHEMBL4558113::US11174268, Example 255
SMILES C[C@H](Nc1cc(F)c(cc1Cl)S(=O)(=O)Nc1cscn1)c1cc(CN2CCC2)ccc1F
InChI Key InChIKey=JYEYDNUQQSHVRP-ZDUSSCGKSA-N
Data  5 IC50  2 EC50
  Tab Delimited (TSV)   2D SDfile   Computed 3D by Vconf -m prep SDfile
Find this compound or compounds like it in BindingDB:
Activity Spreadsheet -- Enzyme Inhibition Constant Data from BindingDB
Found 7 hits for monomerid = 50530542
TargetNuclear receptor subfamily 1 group I member 2(Homo sapiens (Human))
Xenon Pharmaceuticals
Curated by ChEMBL
LigandPNGBDBM50530542(CHEMBL4558113 | US11174268, Example 255)
Affinity DataEC50: >2.00E+4nM. Assay description: Agonist activity at PXR in human DPX2 cells after 24 hrs by luciferase reporter gene assay
Ligand InfoPC cidPC sid
In DepthDetails ArticlePubMed
TargetSodium channel protein type 8 subunit alpha/subunit beta-1(Homo sapiens (Human))
Xenon Pharmaceuticals
Curated by ChEMBL
LigandPNGBDBM50530542(CHEMBL4558113 | US11174268, Example 255)
Affinity DataIC50:  120nM. Assay description: Inhibition of recombinant human full length Nav1.6 co-expressed with human SCN1B in HEK293 cells measured after 20 mins at -45 mV holding potential b...
Ligand InfoPC cidPC sid
In DepthDetails ArticlePubMed
TargetSodium channel protein type 8 subunit alpha/subunit beta-1(Homo sapiens (Human))
Xenon Pharmaceuticals
Curated by ChEMBL
LigandPNGBDBM50530542(CHEMBL4558113 | US11174268, Example 255)
Affinity DataIC50:  120nM. Assay description: Inhibition of recombinant human full length Nav1.6 co-expressed with human SCN1B in HEK293 cells measured after 20 mins at -45 mV holding potential b...
Ligand InfoPC cidPC sid
In DepthDetails ArticlePubMed
TargetSodium channel protein type 1 subunit alpha(Homo sapiens (Human))
Xenon Pharmaceuticals
US Patent
LigandPNGBDBM50530542(CHEMBL4558113 | US11174268, Example 255)
Affinity DataIC50:  7.79E+3nM. Assay description: This sodium influx assay employs the use of the cell permeable, sodium sensitive dye ANG2 to quantify sodium ion influx through sodium channels which...
Ligand InfoPC cidPC sid
In DepthDetails US Patent
TargetSodium channel protein type 8 subunit alpha(Homo sapiens (Human))
Xenon Pharmaceuticals
US Patent
LigandPNGBDBM50530542(CHEMBL4558113 | US11174268, Example 255)
Affinity DataIC50:  471nM. Assay description: This sodium influx assay employs the use of the cell permeable, sodium sensitive dye ANG2 to quantify sodium ion influx through sodium channels which...
Ligand InfoPC cidPC sid
In DepthDetails US Patent
TargetSodium channel protein type 5 subunit alpha(Homo sapiens (Human))
Xenon Pharmaceuticals
US Patent
LigandPNGBDBM50530542(CHEMBL4558113 | US11174268, Example 255)
Affinity DataIC50:  5.98E+3nM. Assay description: This sodium influx assay employs the use of the cell permeable, sodium sensitive dye ANG2 to quantify sodium ion influx through sodium channels which...
Ligand InfoPC cidPC sid
In DepthDetails US Patent
TargetNuclear receptor subfamily 1 group I member 2(Homo sapiens (Human))
Xenon Pharmaceuticals
Curated by ChEMBL
LigandPNGBDBM50530542(CHEMBL4558113 | US11174268, Example 255)
Affinity DataEC50: >2.00E+4nM. Assay description: Agonist activity at PXR in human DPX2 cells after 24 hrs by luciferase reporter gene assay
Ligand InfoPC cidPC sid
In DepthDetails ArticlePubMed