BDBM50531496 CHEMBL4441970
SMILES COc1ccc(cc1)-c1noc(CF)c1-c1ccc(OC)cc1
InChI Key InChIKey=ZSNBFKKVERDHJL-UHFFFAOYSA-N
Data  2 IC50
  Tab Delimited (TSV)   2D SDfile   Computed 3D by Vconf -m prep SDfile
Find this compound or compounds like it in BindingDB:
Activity Spreadsheet -- Enzyme Inhibition Constant Data from BindingDB
Found 2 hits for monomerid = 50531496
TargetProstaglandin G/H synthase 1(Ovis aries (Sheep))
University Of Bari "Aldo Moro
Curated by ChEMBL
LigandPNGBDBM50531496(CHEMBL4441970)
Affinity DataIC50:  350nM. Assay description: Inhibition of ovine COX1 using arachidonic acid as substrate by colorimetric assay
Ligand InfoPC cidPC sid
In DepthDetails ArticlePubMed
TargetProstaglandin G/H synthase 2(Homo sapiens (Human))
University Of Bari "Aldo Moro
Curated by ChEMBL
LigandPNGBDBM50531496(CHEMBL4441970)
Affinity DataIC50:  300nM. Assay description: Inhibition of human COX2 using arachidonic acid as substrate by colorimetric assay
Ligand InfoPC cidPC sid
In DepthDetails ArticlePubMed