BDBM50532704 CHEMBL4434729
SMILES COc1cc2CCN(Cc3ccc(cc3)-c3ccc(OCCCOc4nonc4OCc4ccccc4)cc3)Cc2cc1OC
InChI Key InChIKey=OIMLVEXTXUUPDK-UHFFFAOYSA-N
Data  4 EC50
  Tab Delimited (TSV)   2D SDfile   Computed 3D by Vconf -m prep SDfile
Find this compound or compounds like it in BindingDB:
Activity Spreadsheet -- Enzyme Inhibition Constant Data from BindingDB
Found 4 hits for monomerid = 50532704
TargetATP-dependent translocase ABCB1(Homo sapiens (Human))
Universit£
Curated by ChEMBL
LigandPNGBDBM50532704(CHEMBL4434729)
Affinity DataEC50:  0.970nM. Assay description: Inhibition of MDR1 (unknown origin) expressed in MDCK cells assessed as decrease in calcein-AM transport after 30 mins by fluorescence assay
Ligand InfoPC cidPC sid
In DepthDetails ArticlePubMed
TargetBroad substrate specificity ATP-binding cassette transporter ABCG2(Homo sapiens (Human))
Universit£
Curated by ChEMBL
LigandPNGBDBM50532704(CHEMBL4434729)
Affinity DataEC50: >1.00E+5nM. Assay description: Inhibition of BCRP (unknown origin)
Ligand InfoPC cidPC sid
In DepthDetails ArticlePubMed
TargetBroad substrate specificity ATP-binding cassette transporter ABCG2(Homo sapiens (Human))
Universit£
Curated by ChEMBL
LigandPNGBDBM50532704(CHEMBL4434729)
Affinity DataEC50: >1.00E+5nM. Assay description: Inhibition of BCRP (unknown origin)
Ligand InfoPC cidPC sid
In DepthDetails ArticlePubMed
TargetATP-dependent translocase ABCB1(Homo sapiens (Human))
Universit£
Curated by ChEMBL
LigandPNGBDBM50532704(CHEMBL4434729)
Affinity DataEC50:  0.970nM. Assay description: Inhibition of MDR1 (unknown origin) expressed in MDCK cells assessed as decrease in calcein-AM transport after 30 mins by fluorescence assay
Ligand InfoPC cidPC sid
In DepthDetails ArticlePubMed