BDBM50533129 CHEMBL4526755
SMILES Cc1cc(ccc1C(=O)NC1CC1)-c1cnn2c(NC[C@H]3C[C@H](O)C3)cc(Oc3cccnc3)nc12
InChI Key InChIKey=KOHNZGGWPHLXLU-IRJFHVNHSA-N
Data  2 IC50
  Tab Delimited (TSV)   2D SDfile   Computed 3D by Vconf -m prep SDfile
Find this compound or compounds like it in BindingDB:
Activity Spreadsheet -- Enzyme Inhibition Constant Data from BindingDB
Found 2 hits for monomerid = 50533129
TargetDual specificity protein kinase TTK(Homo sapiens (Human))
Entremed
Curated by ChEMBL
LigandPNGBDBM50533129(CHEMBL4526755)
Affinity DataIC50:  1.10nM. Assay description: Inhibition of full length recombinant N-terminal GST-tagged and sumo-tagged human TTK (1 to 275 residues) expressed in Escherichia coli pre-incubated...
Ligand InfoPC cidPC sid
In DepthDetails ArticlePubMed
TargetDual specificity protein kinase TTK(Homo sapiens (Human))
Entremed
Curated by ChEMBL
LigandPNGBDBM50533129(CHEMBL4526755)
Affinity DataIC50:  1.10nM. Assay description: Inhibition of full length recombinant N-terminal GST-tagged and sumo-tagged human TTK (1 to 275 residues) expressed in Escherichia coli pre-incubated...
Ligand InfoPC cidPC sid
In DepthDetails ArticlePubMed