BDBM50534033 CHEMBL4473153
SMILES O=C(\C=C\c1ccccc1)c1ccc(OCc2cc(no2)-c2ccc3OCCOc3c2)cc1
InChI Key InChIKey=FSZNGACEZPGHHC-WUXMJOGZSA-N
Data  1 EC50
  Tab Delimited (TSV)   2D SDfile   Computed 3D by Vconf -m prep SDfile
Find this compound or compounds like it in BindingDB:
Activity Spreadsheet -- Enzyme Inhibition Constant Data from BindingDB
Found 1 hit for monomerid = 50534033
TargetPolyphenol oxidase 2(Agaricus bisporus (Common mushroom))
Chinese Academy Of Sciences
Curated by ChEMBL
LigandPNGBDBM50534033(CHEMBL4473153)
Affinity DataEC50: >1.00E+5nM. Assay description: Activation of mushroom tyrosinase using L-tyrosine as substrate preincubated for 5 mins followed by substrate addition measured after 30 mins by ELIS...
Ligand InfoPC cidPC sid
In DepthDetails ArticlePubMed