BDBM50534038 CHEMBL4592732
SMILES COc1cccc(Cn2cc(CCc3ccc(cc3)C(=O)\C=C\c3ccccc3)nn2)c1
InChI Key InChIKey=FNLAPXQVJMCRMP-GHRIWEEISA-N
Data  1 EC50
  Tab Delimited (TSV)   2D SDfile   Computed 3D by Vconf -m prep SDfile
Find this compound or compounds like it in BindingDB:
Activity Spreadsheet -- Enzyme Inhibition Constant Data from BindingDB
Found 1 hit for monomerid = 50534038
TargetPolyphenol oxidase 2(Agaricus bisporus (Common mushroom))
Chinese Academy Of Sciences
Curated by ChEMBL
LigandPNGBDBM50534038(CHEMBL4592732)
Affinity DataEC50:  3.74E+4nM. Assay description: Activation of mushroom tyrosinase using L-tyrosine as substrate preincubated for 5 mins followed by substrate addition measured after 30 mins by ELIS...
Ligand InfoPC cidPC sid
In DepthDetails ArticlePubMed