BDBM50534057 CHEMBL4542422
SMILES [O-][N+](=O)c1ccc(cc1)-c1cc(COc2ccc(cc2)C(=O)\C=C\c2ccccc2)on1
InChI Key InChIKey=MPYTWDPXNZREQT-GIDUJCDVSA-N
Data  1 EC50
  Tab Delimited (TSV)   2D SDfile   Computed 3D by Vconf -m prep SDfile
Find this compound or compounds like it in BindingDB:
Activity Spreadsheet -- Enzyme Inhibition Constant Data from BindingDB
Found 1 hit for monomerid = 50534057
TargetPolyphenol oxidase 2(Agaricus bisporus (Common mushroom))
Chinese Academy Of Sciences
Curated by ChEMBL
LigandPNGBDBM50534057(CHEMBL4542422)
Affinity DataEC50: >1.00E+5nM. Assay description: Activation of mushroom tyrosinase using L-tyrosine as substrate preincubated for 5 mins followed by substrate addition measured after 30 mins by ELIS...
Ligand InfoPC cidPC sid
In DepthDetails ArticlePubMed