BDBM50534450 CHEMBL4573196
SMILES CC[C@H](C)[C@H](NC(=O)[C@H](Cc1ccccc1)NC(=O)[C@H](CCC(O)=O)NC(=O)[C@H](CCCNC(N)=N)NC(=O)CNC(=O)[C@H](CO)NC(C)=O)C(=O)N[C@@H](CCCNC(N)=N)C(=O)N[C@@H](CCCCN)C(=O)N[C@@H](C(C)C)C(=O)N[C@@H]([C@@H](C)CC)C(=O)N[C@@H](Cc1ccccc1)C(=O)N[C@@H]([C@@H](C)O)C(=O)N[C@@H](CO)C(=O)NCC(=O)NCC(=O)N[C@@H](CO)C(=O)N[C@@H](CCCNC(N)=N)C(=O)N[C@@H](Cc1c[nH]c2ccccc12)C(O)=O
InChI Key InChIKey=QWXITWPMQUYSSB-BDDBCRLQSA-N
Data  1 KI  3 EC50
  Tab Delimited (TSV)   2D SDfile   Computed 3D by Vconf -m prep SDfile
Find this compound or compounds like it in BindingDB:
Activity Spreadsheet -- Enzyme Inhibition Constant Data from BindingDB
Found 4 hits for monomerid = 50534450
TargetRelaxin-3 receptor 2(Homo sapiens (Human))
Kobe Gakuin University
Curated by ChEMBL
LigandPNGBDBM50534450(CHEMBL4573196)
Affinity DataKi: <1.00E+4nM. Assay description: Displacement of Eu-INSL5 from human RXFP4 receptor expressed in CHOK1 cells by time-resolved fluorescent whole cell binding assay
Ligand InfoPC cidPC sid
In DepthDetails ArticlePubMed
TargetRelaxin-3 receptor 1(Homo sapiens (Human))
Kobe Gakuin University
Curated by ChEMBL
LigandPNGBDBM50534450(CHEMBL4573196)
Affinity DataEC50:  4.57E+3nM. Assay description: Agonist activity at human RXFP3 receptor expressed in CHOK1 cells cotransfected with beta-galactosidase assessed as inhibition of forskolin-stimulate...
Ligand InfoPC cidPC sid
In DepthDetails ArticlePubMed
TargetRelaxin-3 receptor 2(Homo sapiens (Human))
Kobe Gakuin University
Curated by ChEMBL
LigandPNGBDBM50534450(CHEMBL4573196)
Affinity DataEC50:  5.89E+3nM. Assay description: Agonist activity at human RXFP4 receptor expressed in CHOK1 cells cotransfected with beta-galactosidase assessed as inhibition of forskolin-stimulate...
Ligand InfoPC cidPC sid
In DepthDetails ArticlePubMed
TargetRelaxin receptor 1(Homo sapiens (Human))
Kobe Gakuin University
Curated by ChEMBL
LigandPNGBDBM50534450(CHEMBL4573196)
Affinity DataEC50: <1.00E+4nM. Assay description: Agonist activity at RXFP1 receptor (unknown origin) expressed in HEK-293T cells cotransfected with beta-galactosidase assessed as cAMP activation by ...
Ligand InfoPC cidPC sid
In DepthDetails ArticlePubMed