BDBM50534452 CHEMBL4474183
SMILES CC(C)[C@@H]1NC(=O)[C@H](C)NC(=O)[C@H](CCCNC(N)=N)NC(=O)[C@](C)(CCC\C=C/CCC[C@](C)(NC1=O)C(=O)N[C@@H](Cc1ccccc1)C(=O)N[C@@H]([C@@H](C)O)C(=O)N[C@@H](CO)C(=O)NCC(=O)NCC(=O)N[C@@H](CO)C(=O)N[C@@H](CCCNC(N)=N)C(=O)N[C@@H](Cc1c[nH]c2ccccc12)C(O)=O)NC(=O)[C@H](Cc1ccccc1)NC(=O)[C@H](CCC(O)=O)NC(=O)[C@H](CCCNC(N)=N)NC(=O)CNC(=O)[C@H](CO)NC(C)=O
InChI Key InChIKey=OPBGDRSDYSFCBR-TUEQUYMMSA-N
Data  1 KI  1 EC50
  Tab Delimited (TSV)   2D SDfile   Computed 3D by Vconf -m prep SDfile
Find this compound or compounds like it in BindingDB:
Activity Spreadsheet -- Enzyme Inhibition Constant Data from BindingDB
Found 2 hits for monomerid = 50534452
TargetRelaxin-3 receptor 2(Homo sapiens (Human))
Kobe Gakuin University
Curated by ChEMBL
LigandPNGBDBM50534452(CHEMBL4474183)
Affinity DataKi:  1.48E+3nM. Assay description: Displacement of Eu-INSL5 from human RXFP4 receptor expressed in CHOK1 cells by time-resolved fluorescent whole cell binding assay
Ligand InfoPC cidPC sid
In DepthDetails ArticlePubMed
TargetRelaxin-3 receptor 2(Homo sapiens (Human))
Kobe Gakuin University
Curated by ChEMBL
LigandPNGBDBM50534452(CHEMBL4474183)
Affinity DataEC50:  501nM. Assay description: Agonist activity at human RXFP4 receptor expressed in CHOK1 cells cotransfected with beta-galactosidase assessed as inhibition of forskolin-stimulate...
Ligand InfoPC cidPC sid
In DepthDetails ArticlePubMed