BDBM50537387 CHEMBL4591768
SMILES COc1cccc2n(c(nc12)C(F)F)-c1nc(nc(n1)N1CCOCC1)N1CC(C1)NS(=O)(=O)CCN(C)C
InChI Key InChIKey=DPEQMYIZBXDATE-UHFFFAOYSA-N
Data  3 IC50
  Tab Delimited (TSV)   2D SDfile   Computed 3D by Vconf -m prep SDfile
Find this compound or compounds like it in BindingDB:
Activity Spreadsheet -- Enzyme Inhibition Constant Data from BindingDB
Found 3 hits for monomerid = 50537387
LigandPNGBDBM50537387(CHEMBL4591768)
Affinity DataIC50:  715nM. Assay description: Inhibition of recombinant human N-terminal p110beta/p85alpha expressed in baculovirus infected Sf9 insect cells using PIP2 as substrate by HTRF assay
Ligand InfoPC cidPC sid
In DepthDetails ArticlePubMed
LigandPNGBDBM50537387(CHEMBL4591768)
Affinity DataIC50:  13nM. Assay description: Inhibition of recombinant human N-terminal p110alpha/p85alpha expressed in baculovirus infected Sf9 insect cells using PIP2 as substrate by HTRF assa...
Ligand InfoPC cidPC sid
In DepthDetails ArticlePubMed
LigandPNGBDBM50537387(CHEMBL4591768)
Affinity DataIC50:  219nM. Assay description: Inhibition of recombinant human N-terminal p110delta/p85alpha expressed in baculovirus infected Sf9 insect cells using PIP2 as substrate by HTRF assa...
Ligand InfoPC cidPC sid
In DepthDetails ArticlePubMed