BDBM50537402 CHEMBL4589962
SMILES COc1cccc2n(c(nc12)C(F)F)-c1nc(nc(n1)N1CCN(CC1)S(=O)(=O)CCn1ccnc1)N1CCOCC1
InChI Key InChIKey=OIVLGLSLBPQAPK-UHFFFAOYSA-N
Data  3 IC50
  Tab Delimited (TSV)   2D SDfile   Computed 3D by Vconf -m prep SDfile
Find this compound or compounds like it in BindingDB:
Activity Spreadsheet -- Enzyme Inhibition Constant Data from BindingDB
Found 3 hits for monomerid = 50537402
LigandPNGBDBM50537402(CHEMBL4589962)
Affinity DataIC50: >1.25E+3nM. Assay description: Inhibition of recombinant human N-terminal p110beta/p85alpha expressed in baculovirus infected Sf9 insect cells using PIP2 as substrate by HTRF assay
Ligand InfoPC cidPC sid
In DepthDetails ArticlePubMed
LigandPNGBDBM50537402(CHEMBL4589962)
Affinity DataIC50:  62nM. Assay description: Inhibition of recombinant human N-terminal p110delta/p85alpha expressed in baculovirus infected Sf9 insect cells using PIP2 as substrate by HTRF assa...
Ligand InfoPC cidPC sid
In DepthDetails ArticlePubMed
LigandPNGBDBM50537402(CHEMBL4589962)
Affinity DataIC50:  5.80nM. Assay description: Inhibition of recombinant human N-terminal p110alpha/p85alpha expressed in baculovirus infected Sf9 insect cells using PIP2 as substrate by HTRF assa...
Ligand InfoPC cidPC sid
In DepthDetails ArticlePubMed