BDBM50538468 CHEMBL4640138
SMILES C1OCC1N1CCN(CC1)c1ccc(Nc2nc(cn3ccnc23)-c2cnc3cc[nH]c3c2)cc1
InChI Key InChIKey=IMVFUHWEBMBMBY-UHFFFAOYSA-N
Data  1 IC50  2 EC50
  Tab Delimited (TSV)   2D SDfile   Computed 3D by Vconf -m prep SDfile
Find this compound or compounds like it in BindingDB:
Activity Spreadsheet -- Enzyme Inhibition Constant Data from BindingDB
Found 3 hits for monomerid = 50538468
TargetTyrosine-protein kinase SYK(Homo sapiens (Human))
Gilead Sciences
Curated by ChEMBL
LigandPNGBDBM50538468(CHEMBL4640138)
Affinity DataIC50:  6.90nM. Assay description: Inhibition of SYK (unknown origin) using XL665-labeled peptide as substrate in presence of ATP measured after 30 mins by TR-FRET assay
Ligand InfoPC cidPC sid
In DepthDetails ArticlePubMed
TargetTyrosine-protein kinase SYK(Homo sapiens (Human))
Gilead Sciences
Curated by ChEMBL
LigandPNGBDBM50538468(CHEMBL4640138)
Affinity DataEC50:  78nM. Assay description: Inhibition of SYK in human whole blood assessed as reduction in anti-FCepsilonR1 mAb-induced basophil activation by measuring decrease in CD63 surfac...
Ligand InfoPC cidPC sid
In DepthDetails ArticlePubMed
TargetTyrosine-protein kinase SYK(Homo sapiens (Human))
Gilead Sciences
Curated by ChEMBL
LigandPNGBDBM50538468(CHEMBL4640138)
Affinity DataEC50:  46nM. Assay description: Inhibition of SYK in human Ramos cells assessed as reduction in antihuman IgM F(ab)2-induced phosphorylation of BLNK at Y96 residue preincubated for ...
Ligand InfoPC cidPC sid
In DepthDetails ArticlePubMed