BDBM50538561 CHEMBL4642308
SMILES Clc1cc2C[C@@H](Oc2c(c1)-c1ccnc2cc(CN3C(=O)CCC3=O)sc12)c1ocnc1CN1CCC1
InChI Key InChIKey=ZUAACQXOFSMOEP-JOCHJYFZSA-N
Data  1 IC50
  Tab Delimited (TSV)   2D SDfile   Computed 3D by Vconf -m prep SDfile
Find this compound or compounds like it in BindingDB:
Activity Spreadsheet -- Enzyme Inhibition Constant Data from BindingDB
Found 1 hit for monomerid = 50538561
TargetUbiquitin carboxyl-terminal hydrolase 7(Homo sapiens (Human))
Rapt Therapeutics
Curated by ChEMBL
LigandPNGBDBM50538561(CHEMBL4642308)
Affinity DataIC50:  13nM. Assay description: Inhibition of recombinant full length USP7 (unknown origin) using ubiquintin-rhodamine as substrate preincubated for 30 mins followed by substrate ad...
Ligand InfoPC cidPC sid
In DepthDetails ArticlePubMed