BDBM50538583 CHEMBL4643112
SMILES Cc1cc(Cl)cc(c1CC1CCCNC1)-c1ccnc2cc(CN3C(=O)C4C(C3=O)C4(C)C)sc12
InChI Key InChIKey=XXQHINVMIVHNET-UHFFFAOYSA-N
Data  1 IC50  1 EC50
  Tab Delimited (TSV)   2D SDfile   Computed 3D by Vconf -m prep SDfile
Find this compound or compounds like it in BindingDB:
Activity Spreadsheet -- Enzyme Inhibition Constant Data from BindingDB
Found 2 hits for monomerid = 50538583
TargetUbiquitin carboxyl-terminal hydrolase 7(Homo sapiens (Human))
Rapt Therapeutics
Curated by ChEMBL
LigandPNGBDBM50538583(CHEMBL4643112)
Affinity DataEC50:  130nM. Assay description: Inhibition of USP7 in human RKO cells transfected with p53 luciferase reporter vector assessed as increase in p53-dependent luciferase activity measu...
Ligand InfoPC cidPC sid
In DepthDetails ArticlePubMed
TargetUbiquitin carboxyl-terminal hydrolase 7(Homo sapiens (Human))
Rapt Therapeutics
Curated by ChEMBL
LigandPNGBDBM50538583(CHEMBL4643112)
Affinity DataIC50:  1.30nM. Assay description: Inhibition of recombinant full length USP7 (unknown origin) using ubiquintin-rhodamine as substrate preincubated for 30 mins followed by substrate ad...
Ligand InfoPC cidPC sid
In DepthDetails ArticlePubMed