BDBM50538946 CHEMBL4646575
SMILES OC[C@H]1O[C@H]([C@H](O)[C@@H](O)[C@@H]1O)c1c[nH]c(n1)-c1ccc2ccccc2c1
InChI Key InChIKey=VRUXFQSZTNCMBM-SFFUCWETSA-N
Data  1 KI
PDB links: 1 PDB ID matches this monomer.
  Tab Delimited (TSV)   2D SDfile   Computed 3D by Vconf -m prep SDfile
Find this compound or compounds like it in BindingDB:
Activity Spreadsheet -- Enzyme Inhibition Constant Data from BindingDB
Found 1 hit for monomerid = 50538946
TargetGlycogen phosphorylase, liver form(Homo sapiens (Human))
University Of Thessaly
Curated by ChEMBL
LigandPNGBDBM50538946(CHEMBL4646575)
Affinity DataKi:  3.20E+3nM. Assay description: Inhibition of human liver GPa using Glc-1-P as substrate incubated for 15 mins
Ligand InfoPC cidPC sidPDB
In DepthDetails ArticlePubMed