BDBM50539112 CHEMBL4647600
SMILES CN1c2ccc(NC(=O)Nc3ccc(OC(F)(F)F)cc3)cc2C(C)(C)C(=O)C1(C)C
InChI Key InChIKey=CIDAYSNVWURYBG-UHFFFAOYSA-N
Data  1 Kd
  Tab Delimited (TSV)   2D SDfile   Computed 3D by Vconf -m prep SDfile
Find this compound or compounds like it in BindingDB:
Activity Spreadsheet -- Enzyme Inhibition Constant Data from BindingDB
Found 1 hit for monomerid = 50539112
TargetStress-70 protein, mitochondrial(Homo sapiens)
Oklahoma State University
Curated by ChEMBL
LigandPNGBDBM50539112(CHEMBL4647600)
Affinity DataKd:  1.80E+3nM. Assay description: Binding affinity to mortalin substrate binding domain (unknown origin)
Ligand InfoPC cidPC sid
In DepthDetails ArticlePubMed