BDBM50539664 CHEMBL4647314
SMILES CCOc1cc(C)c(cc1N1CCOCC1)C(=O)NC(=O)Nc1nc2ccc(CN3CCN(C)CC3)cc2s1
InChI Key InChIKey=QBPIGLSGJHKQCQ-UHFFFAOYSA-N
Data  1 EC50
  Tab Delimited (TSV)   2D SDfile   Computed 3D by Vconf -m prep SDfile
Find this compound or compounds like it in BindingDB:
Activity Spreadsheet -- Enzyme Inhibition Constant Data from BindingDB
Found 1 hit for monomerid = 50539664
TargetHydroxycarboxylic acid receptor 1(Homo sapiens (Human))
Astrazeneca
Curated by ChEMBL
LigandPNGBDBM50539664(CHEMBL4647314)
Affinity DataEC50: >3.70E+3nM. Assay description: Agonist activity at human GPR81 overexpressed in CHO cells assessed as inhibition of forskolin-stimulated cAMP production
Ligand InfoPC cidPC sid
In DepthDetails ArticlePubMed