BDBM50539679 CHEMBL4638731
SMILES CCOc1cc(Cl)c(cc1N1CCOCC1)C(=O)NC(=O)Nc1nc2CCN(Cc2s1)C(C)=O
InChI Key InChIKey=SUPPGYHTAHGWHH-UHFFFAOYSA-N
Data  1 EC50
  Tab Delimited (TSV)   2D SDfile   Computed 3D by Vconf -m prep SDfile
Find this compound or compounds like it in BindingDB:
Activity Spreadsheet -- Enzyme Inhibition Constant Data from BindingDB
Found 1 hit for monomerid = 50539679
TargetHydroxycarboxylic acid receptor 1(Homo sapiens (Human))
Astrazeneca
Curated by ChEMBL
LigandPNGBDBM50539679(CHEMBL4638731)
Affinity DataEC50:  719nM. Assay description: Agonist activity at human GPR81 overexpressed in CHO cells assessed as inhibition of forskolin-stimulated cAMP production
Ligand InfoPC cidPC sid
In DepthDetails ArticlePubMed