BDBM50539690 CHEMBL4645314
SMILES CCOc1cc(Cl)c(cc1N1CCOCC1)-c1ncc(-c2nc3ccc(cc3s2)S(=O)(=O)C2CCN(C)CC2)c(=O)[nH]1
InChI Key InChIKey=KGZNYDFUINOSHN-UHFFFAOYSA-N
Data  1 IC50  2 EC50
  Tab Delimited (TSV)   2D SDfile   Computed 3D by Vconf -m prep SDfile
Find this compound or compounds like it in BindingDB:
Activity Spreadsheet -- Enzyme Inhibition Constant Data from BindingDB
Found 3 hits for monomerid = 50539690
TargetHydroxycarboxylic acid receptor 1(Homo sapiens (Human))
Astrazeneca
Curated by ChEMBL
LigandPNGBDBM50539690(CHEMBL4645314)
Affinity DataEC50:  240nM. Assay description: Agonist activity at human GPR81 overexpressed in CHO cells assessed as inhibition of forskolin-stimulated cAMP production
Ligand InfoPC cidPC sid
In DepthDetails ArticlePubMed
TargetHydroxycarboxylic acid receptor 2(Homo sapiens (Human))
Astrazeneca
Curated by ChEMBL
LigandPNGBDBM50539690(CHEMBL4645314)
Affinity DataEC50:  1.60E+3nM. Assay description: Agonist activity at human GPR109A receptor
Ligand InfoPC cidPC sid
In DepthDetails ArticlePubMed
TargetGrowth hormone secretagogue receptor type 1(Homo sapiens (Human))
Astrazeneca
Curated by ChEMBL
LigandPNGBDBM50539690(CHEMBL4645314)
Affinity DataIC50: >1.80E+4nM. Assay description: Displacement of [125I]-ghrelin from human GHS-R1a stably expressed in HEK cell membrane measured after 60 mins by gamma counter method
Ligand InfoPC cidPC sid
In DepthDetails ArticlePubMed