BDBM50539858 CHEMBL4639447
SMILES Cc1cn([C@H]2C[C@@H]([C@@H](CO)O2)n2cc(CCCOc3ccc4oc(=O)ccc4c3)nn2)c(=O)[nH]c1=O
InChI Key InChIKey=KOFMFRQCGVRMQO-CEWLAPEOSA-N
Data  7 KI
  Tab Delimited (TSV)   2D SDfile   Computed 3D by Vconf -m prep SDfile
Find this compound or compounds like it in BindingDB:
Activity Spreadsheet -- Enzyme Inhibition Constant Data from BindingDB
Found 7 hits for monomerid = 50539858
TargetCarbonic anhydrase 7(Homo sapiens (Human))
Universit£
Curated by ChEMBL
LigandPNGBDBM50539858(CHEMBL4639447)
Affinity DataKi:  0.700nM. Assay description: Inhibition of human CA7 pre-incubated for 15 mins by stopped flow CO2 hydrase assay
Ligand InfoPC cidPC sid
In DepthDetails ArticlePubMed
TargetCarbonic anhydrase 12(Homo sapiens (Human))
Universit£
Curated by ChEMBL
LigandPNGBDBM50539858(CHEMBL4639447)
Affinity DataKi:  9.40nM. Assay description: Inhibition of human CA12 pre-incubated for 15 mins by stopped flow CO2 hydrase assay
Ligand InfoPC cidPC sid
In DepthDetails ArticlePubMed
TargetCarbonic anhydrase 9(Homo sapiens (Human))
Universit£
Curated by ChEMBL
LigandPNGBDBM50539858(CHEMBL4639447)
Affinity DataKi:  21nM. Assay description: Inhibition of human CA9 pre-incubated for 15 mins by stopped flow CO2 hydrase assay
Ligand InfoPC cidPC sid
In DepthDetails ArticlePubMed
TargetCarbonic anhydrase 5B, mitochondrial(Homo sapiens (Human))
Universit£
Curated by ChEMBL
LigandPNGBDBM50539858(CHEMBL4639447)
Affinity DataKi:  40nM. Assay description: Inhibition of human CA5B pre-incubated for 15 mins by stopped flow CO2 hydrase assay
Ligand InfoPC cidPC sid
In DepthDetails ArticlePubMed
TargetCarbonic anhydrase 5A, mitochondrial(Homo sapiens (Human))
Universit£
Curated by ChEMBL
LigandPNGBDBM50539858(CHEMBL4639447)
Affinity DataKi:  667nM. Assay description: Inhibition of human CA5A pre-incubated for 15 mins by stopped flow CO2 hydrase assay
Ligand InfoPC cidPC sid
In DepthDetails ArticlePubMed
TargetCarbonic anhydrase 1(Homo sapiens (Human))
Universit£
Curated by ChEMBL
LigandPNGBDBM50539858(CHEMBL4639447)
Affinity DataKi: >1.00E+4nM. Assay description: Inhibition of human CA1 pre-incubated for 15 mins by stopped flow CO2 hydrase assay
Ligand InfoPC cidPC sid
In DepthDetails ArticlePubMed
TargetCarbonic anhydrase 2(Homo sapiens (Human))
Universit£
Curated by ChEMBL
LigandPNGBDBM50539858(CHEMBL4639447)
Affinity DataKi: >1.00E+4nM. Assay description: Inhibition of human CA2 pre-incubated for 15 mins by stopped flow CO2 hydrase assay
Ligand InfoPC cidPC sid
In DepthDetails ArticlePubMed