BDBM50541195 CHEMBL4634942
SMILES CC1CN2CCNCc3ccc(Cl)c1c23
InChI Key InChIKey=PXYOIRBEMWJOGX-UHFFFAOYSA-N
Data  3 KI  3 EC50
  Tab Delimited (TSV)   2D SDfile   Computed 3D by Vconf -m prep SDfile
Find this compound or compounds like it in BindingDB:
Activity Spreadsheet -- Enzyme Inhibition Constant Data from BindingDB
Found 6 hits for monomerid = 50541195
Target5-hydroxytryptamine receptor 2C(Homo sapiens (Human))
Arena Pharmaceuticals
Curated by ChEMBL
LigandPNGBDBM50541195(CHEMBL4634942)
Affinity DataKi:  0.800nM. Assay description: Displacement of [125I]-1,4-Iodanyl-2,5-dimethoxyphenyl)propan-2amine from 5HT2C receptor (unknown origin)
Ligand InfoPC cidPC sid
In DepthDetails ArticlePubMed
Target5-hydroxytryptamine receptor 2A(Homo sapiens (Human))
Arena Pharmaceuticals
Curated by ChEMBL
LigandPNGBDBM50541195(CHEMBL4634942)
Affinity DataKi:  44nM. Assay description: Displacement of [125I]-1,4-Iodanyl-2,5-dimethoxyphenyl)propan-2amine from 5HT2A receptor (unknown origin)
Ligand InfoPC cidPC sid
In DepthDetails ArticlePubMed
Target5-hydroxytryptamine receptor 2B(Homo sapiens (Human))
Arena Pharmaceuticals
Curated by ChEMBL
LigandPNGBDBM50541195(CHEMBL4634942)
Affinity DataKi:  46nM. Assay description: Displacement of [125I]-1,4-Iodanyl-2,5-dimethoxyphenyl)propan-2amine from 5HT2B receptor (unknown origin)
Ligand InfoPC cidPC sid
In DepthDetails ArticlePubMed
Target5-hydroxytryptamine receptor 2A(Homo sapiens (Human))
Arena Pharmaceuticals
Curated by ChEMBL
LigandPNGBDBM50541195(CHEMBL4634942)
Affinity DataEC50:  1.22E+3nM. Assay description: Partial agonist activity at 5HT2A receptor (unknown origin)
Ligand InfoPC cidPC sid
In DepthDetails ArticlePubMed
Target5-hydroxytryptamine receptor 2C(Homo sapiens (Human))
Arena Pharmaceuticals
Curated by ChEMBL
LigandPNGBDBM50541195(CHEMBL4634942)
Affinity DataEC50:  2.5nM. Assay description: Agonist activity at 5HT2C receptor (unknown origin)
Ligand InfoPC cidPC sid
In DepthDetails ArticlePubMed
Target5-hydroxytryptamine receptor 2B(Homo sapiens (Human))
Arena Pharmaceuticals
Curated by ChEMBL
LigandPNGBDBM50541195(CHEMBL4634942)
Affinity DataEC50:  325nM. Assay description: Agonist activity at 5HT2B receptor (unknown origin)
Ligand InfoPC cidPC sid
In DepthDetails ArticlePubMed