BDBM50541937 CHEMBL4637250
SMILES Nc1nc(n[nH]1)N1CCC(CC1)N(CCc1ccc(Cl)cc1)Cc1ccncc1Cl
InChI Key InChIKey=ANYIBKZROMWRSD-UHFFFAOYSA-N
Data  3 IC50
  Tab Delimited (TSV)   2D SDfile   Computed 3D by Vconf -m prep SDfile
Find this compound or compounds like it in BindingDB:
Activity Spreadsheet -- Enzyme Inhibition Constant Data from BindingDB
Found 3 hits for monomerid = 50541937
TargetAcidic mammalian chitinase(Homo sapiens (Human))
Oncoarendi Therapeutics
Curated by ChEMBL
LigandPNGBDBM50541937(CHEMBL4637250)
Affinity DataIC50:  15nM. Assay description: Inhibition of full length recombinant C-terminal His-tagged human acidic mammalian chitinase expressed in CHOK1 cells assessed as reduction in chitin...
Ligand InfoPC cidPC sid
In DepthDetails ArticlePubMed
TargetPotassium voltage-gated channel subfamily H member 2(Homo sapiens (Human))
Oncoarendi Therapeutics
Curated by ChEMBL
LigandPNGBDBM50541937(CHEMBL4637250)
Affinity DataIC50:  6.40E+3nM. Assay description: Displacement of Tracer Red from human ERG by fluorescence polarization assay
Ligand InfoPC cidPC sid
In DepthDetails ArticlePubMed
TargetChitotriosidase-1(Homo sapiens (Human))
Oncoarendi Therapeutics
Curated by ChEMBL
LigandPNGBDBM50541937(CHEMBL4637250)
Affinity DataIC50:  620nM. Assay description: Inhibition of full length recombinant C-terminal His-taged human CHIT1 expressed in CHOK1 cells assessed as reduction in chitinolytic activity using ...
Ligand InfoPC cidPC sid
In DepthDetails ArticlePubMed