BDBM50543278 CHEMBL4644794
SMILES OC(=O)C(F)(F)F.OC(=O)C(F)(F)F.NCCCCCCCNc1c(NCCCOc2cccc(CN3CCCCC3)c2)c(=O)c1=O
InChI Key InChIKey=AUIBISWHSJEKKU-UHFFFAOYSA-N
Data  1 KI
  Tab Delimited (TSV)   2D SDfile   Computed 3D by Vconf -m prep SDfile
Find this compound or compounds like it in BindingDB:
Activity Spreadsheet -- Enzyme Inhibition Constant Data from BindingDB
Found 1 hit for monomerid = 50543278
TargetHistamine H2 receptor(Homo sapiens (Human))
University Of Regensburg
Curated by ChEMBL
LigandPNGBDBM50543278(CHEMBL4644794)
Affinity DataKi:  14nM. Assay description: Displacement of [3H]UR-DE257 from Gsalphas-coupled human H2R expressed in baculovirus infected Sf9 cells incubated for 60 mins by scintillation count...
Ligand InfoPC cidPC sid
In DepthDetails ArticlePubMed