BDBM50543281 CHEMBL4644467
SMILES OC(=O)C(F)(F)F.[O-]C(=O)C(F)(F)F.CN(C)c1ccc(\C=C\C=C\c2cc(C)[n+](CCCCCCCNc3c(NCCCOc4cccc(CN5CCCCC5)c4)c(=O)c3=O)c(C)c2)cc1
InChI Key InChIKey=OAVRHILPUHUKOZ-UHFFFAOYSA-N
Data  1 KI  3 Kd
  Tab Delimited (TSV)   2D SDfile   Computed 3D by Vconf -m prep SDfile
Find this compound or compounds like it in BindingDB:
Activity Spreadsheet -- Enzyme Inhibition Constant Data from BindingDB
Found 4 hits for monomerid = 50543281
TargetHistamine H2 receptor(Homo sapiens (Human))
University Of Regensburg
Curated by ChEMBL
LigandPNGBDBM50543281(CHEMBL4644467)
Affinity DataKi:  17nM. Assay description: Displacement of [3H]UR-DE257 from Gsalphas-coupled human H2R expressed in baculovirus infected Sf9 cells incubated for 60 mins by scintillation count...
Ligand InfoPC cidPC sid
In DepthDetails ArticlePubMed
TargetHistamine H2 receptor(Homo sapiens (Human))
University Of Regensburg
Curated by ChEMBL
LigandPNGBDBM50543281(CHEMBL4644467)
Affinity DataKd:  89nM. Assay description: Binding affinity to human H2R expressed in human HEK293T cells incubated for 60 mins by automated cell imaging analysis
Ligand InfoPC cidPC sid
In DepthDetails ArticlePubMed
TargetHistamine H2 receptor(Homo sapiens (Human))
University Of Regensburg
Curated by ChEMBL
LigandPNGBDBM50543281(CHEMBL4644467)
Affinity DataKd:  65nM. Assay description: Binding affinity to human H2R expressed in human HEK293T cells incubated for 60 mins by imaging flow cytometry analysis
Ligand InfoPC cidPC sid
In DepthDetails ArticlePubMed
TargetHistamine H2 receptor(Homo sapiens (Human))
University Of Regensburg
Curated by ChEMBL
LigandPNGBDBM50543281(CHEMBL4644467)
Affinity DataKd:  19nM. Assay description: Binding affinity to human H2R expressed in human HEK293T cells incubated for 90 mins by flowcytometry
Ligand InfoPC cidPC sid
In DepthDetails ArticlePubMed