BDBM50546283 CHEMBL4797225
SMILES C[C@H](Nc1nc(Cl)nc2n(ccc12)[C@@H]1O[C@H](COP(O)(=O)CP(O)(O)=O)[C@@H](O)[C@H]1O)c1cccc(F)c1
InChI Key InChIKey=MWFRGJZEWIWENB-ZBFVOTQZSA-N
Data  1 IC50
  Tab Delimited (TSV)   2D SDfile   Computed 3D by Vconf -m prep SDfile
Find this compound or compounds like it in BindingDB:
Activity Spreadsheet -- Enzyme Inhibition Constant Data from BindingDB
Found 1 hit for monomerid = 50546283
Target5'-nucleotidase(Homo sapiens (Human))
Arcus Biosciences
Curated by ChEMBL
LigandPNGBDBM50546283(CHEMBL4797225)
Affinity DataIC50:  0.0320nM. Assay description: Inhibition of human CD73 expressed in CHO cells using AMP as substrate preincubated for 60 mins followed by substrate addition and measured after 60 ...
Ligand InfoPC cidPC sid
In DepthDetails ArticlePubMed