BDBM50546326 CHEMBL4744502
SMILES O[C@H]1[C@@H](O)[C@@H](O[C@@H]1COP(O)(=O)CP(O)(O)=O)n1cnc2c(NC3CCCC3)nc(Cl)nc12
InChI Key InChIKey=RHHWLGRDPOFERO-SDBHATRESA-N
Data  1 IC50
  Tab Delimited (TSV)   2D SDfile   Computed 3D by Vconf -m prep SDfile
Find this compound or compounds like it in BindingDB:
Activity Spreadsheet -- Enzyme Inhibition Constant Data from BindingDB
Found 1 hit for monomerid = 50546326
Target5'-nucleotidase(Homo sapiens (Human))
Arcus Biosciences
Curated by ChEMBL
LigandPNGBDBM50546326(CHEMBL4744502)
Affinity DataIC50:  0.200nM. Assay description: Inhibition of human CD73 expressed in CHO cells using AMP as substrate preincubated for 60 mins followed by substrate addition and measured after 60 ...
Ligand InfoPC cidPC sid
In DepthDetails ArticlePubMed