BDBM50546818 CHEMBL4745116
SMILES COc1ccc(Cn2c(CCc3ccccc3)nnc2[C@@H](Cc2c[nH]c3ccccc23)NC(=O)CNC(=O)C(=C\c2ccc(cc2)N(C)C)\C#N)cc1
InChI Key InChIKey=DFAJBEHUTREYIS-FOJUAHGCSA-N
Data  1 KI  1 EC50
  Tab Delimited (TSV)   2D SDfile   Computed 3D by Vconf -m prep SDfile
Find this compound or compounds like it in BindingDB:
Activity Spreadsheet -- Enzyme Inhibition Constant Data from BindingDB
Found 2 hits for monomerid = 50546818
TargetGrowth hormone secretagogue receptor type 1(Homo sapiens (Human))
Univ Montpellier
Curated by ChEMBL
LigandPNGBDBM50546818(CHEMBL4745116)
Affinity DataKi:  2.40nM. Assay description: Displacement of red-ghrelin from SNAP-tagged human GHSR expressed in HEK293 cells incubated for 3 hrs at 4 degC or for 1 hr at room temperature by HT...
Ligand InfoPC cidPC sid
In DepthDetails PubMed
TargetGrowth hormone secretagogue receptor type 1(Homo sapiens (Human))
Univ Montpellier
Curated by ChEMBL
LigandPNGBDBM50546818(CHEMBL4745116)
Affinity DataEC50:  89nM. Assay description: Inverse agonist activity at SNAP-tagged human GHSR expressed in HEK293 cells assessed as inhibition of ghrelin-induced IP1 response measured after 30...
Ligand InfoPC cidPC sid
In DepthDetails PubMed