BDBM50547691 CHEMBL4792431
SMILES CC(C)C[C@H](NC(=O)CNC(=O)[C@H](CCCCNC(C)=O)NC(=O)CNC(=O)CNC(=O)[C@H](CCCCNC(C)=O)NC(=O)CNC(=O)[C@H](CCCNC(N)=N)NC(=O)CNC(=O)[C@@H](N)CO)C(O)=O
InChI Key InChIKey=IERKXCAWBBUKSJ-IIZANFQQSA-N
Data  1 Kd
  Tab Delimited (TSV)   2D SDfile   Computed 3D by Vconf -m prep SDfile
Find this compound or compounds like it in BindingDB:
Activity Spreadsheet -- Enzyme Inhibition Constant Data from BindingDB
Found 1 hit for monomerid = 50547691
TargetATPase family AAA domain-containing protein 2B(Homo sapiens (Human))
Albany College Of Pharmacy And Health Sciences
Curated by ChEMBL
LigandPNGBDBM50547691(CHEMBL4792431)
Affinity DataKd:  2.81E+4nM. Assay description: Binding affinity to N-terminal GST tagged human ATAD2B (953-1085 residues) expressed in Escherichia coli by ITC analysis
Ligand InfoKEGGPC cidPC sid
In DepthDetails ArticlePubMed