BDBM50547989 CHEMBL4747872
SMILES CC[C@H](C)[C@@H]1NC(=O)[C@H](Cc2ccc(O)cc2)NC(=O)[C@@H](NC(=O)[C@@H](NC(=O)[C@@H](NC(=O)[C@H](CCCNC(N)=N)NC(=O)[C@@H](NC(=O)[C@H](Cc2ccc(O)cc2)NC(=O)[C@H](CCC(O)=O)NC(=O)[C@H](CC(C)C)NC(=O)CNC(=O)[C@H](CSSC[C@H](N)C(=O)N[C@@H]([C@@H](C)O)C(=O)N[C@@H](CC(O)=O)C(=O)NCC(=O)N[C@@H](C)C(=O)N[C@@H](CO)C(=O)N[C@@H](CCSC)C(=O)N[C@@H](CCCCN)C(=O)N[C@@H](CC(O)=O)C(=O)N[C@@H](CC(C)C)C(=O)N[C@@H](CO)C(=O)N[C@@H](C)C(=O)N[C@@H](CC(C)C)C(=O)N[C@@H](CSSC[C@H](NC1=O)C(=O)N[C@@H](C)C(=O)N[C@@H](CO)C(=O)N[C@@H](CO)C(=O)N[C@@H](CCCNC(N)=N)C(=O)N[C@@H](Cc1c[nH]c2ccccc12)C(O)=O)C(O)=O)NC(=O)[C@H](CC(C)C)NC(=O)[C@H](CCCNC(N)=N)NC(=O)[C@@H](NC(=O)[C@H](CO)NC(=O)[C@H](CCC(O)=O)NC(=O)[C@@H](N)CCCCN)C(C)C)[C@@H](C)CC)[C@@H](C)O)C(C)C)[C@@H](C)CC
InChI Key InChIKey=SQRYKGBNYYGUAG-AFVIGRALSA-N
Data  3 KI  3 EC50
  Tab Delimited (TSV)   2D SDfile   Computed 3D by Vconf -m prep SDfile
Find this compound or compounds like it in BindingDB:
Activity Spreadsheet -- Enzyme Inhibition Constant Data from BindingDB
Found 6 hits for monomerid = 50547989
TargetRelaxin-3 receptor 2(Homo sapiens (Human))
The University Of Queensland
Curated by ChEMBL
LigandPNGBDBM50547989(CHEMBL4747872)
Affinity DataKi:  30nM. Assay description: Displacement of europium-labeled Eu(A)-mINSL5 from human RXFP4 expressed in CHO-K1 cells
Ligand InfoPC cidPC sid
In DepthDetails ArticlePubMed
TargetRelaxin-3 receptor 2(Homo sapiens (Human))
The University Of Queensland
Curated by ChEMBL
LigandPNGBDBM50547989(CHEMBL4747872)
Affinity DataKi:  30nM. Assay description: Displacement of europium-labeled Eu(A)-mINSL5 from human RXFP4 expressed in CHO-K1 cells
Ligand InfoPC cidPC sid
In DepthDetails ArticlePubMed
TargetRelaxin-3 receptor 2(Homo sapiens (Human))
The University Of Queensland
Curated by ChEMBL
LigandPNGBDBM50547989(CHEMBL4747872)
Affinity DataKi:  35nM. Assay description: Competitive binding affinity to human RXFP4 receptor transfected in CHO-K1 cells in presence of europium-labeled Eu(A)-R3/I5 by fluorometric analysis
Ligand InfoPC cidPC sid
In DepthDetails ArticlePubMed
TargetRelaxin-3 receptor 2(Homo sapiens (Human))
The University Of Queensland
Curated by ChEMBL
LigandPNGBDBM50547989(CHEMBL4747872)
Affinity DataEC50:  21nM. Assay description: Agonist activity at human RXFP4 expressed in CHO-K1 cells assessed as reduction in forskolin-induced cAMP production by pCRE beta-galactosidase repor...
Ligand InfoPC cidPC sid
In DepthDetails ArticlePubMed
TargetRelaxin-3 receptor 2(Homo sapiens (Human))
The University Of Queensland
Curated by ChEMBL
LigandPNGBDBM50547989(CHEMBL4747872)
Affinity DataEC50:  21nM. Assay description: Agonist activity at human RXFP4 expressed in CHO-K1 cells assessed as reduction in forskolin-induced cAMP production by pCRE beta-galactosidase repor...
Ligand InfoPC cidPC sid
In DepthDetails ArticlePubMed
TargetRelaxin-3 receptor 2(Homo sapiens (Human))
The University Of Queensland
Curated by ChEMBL
LigandPNGBDBM50547989(CHEMBL4747872)
Affinity DataEC50:  7.90nM. Assay description: Agonist activity at human RXFP4 transfected in CHO-K1 cells co-transfected with pCRE-beta-galactosidase reporter plasmid assessed as inhibition of fo...
Ligand InfoPC cidPC sid
In DepthDetails ArticlePubMed