BDBM50548268 CHEMBL4759091
SMILES Cc1nc2c(N)nc(N)nc2nc1O
InChI Key InChIKey=HJIYAWDHZICEAC-UHFFFAOYSA-N
Data  1 IC50
  Tab Delimited (TSV)   2D SDfile   Computed 3D by Vconf -m prep SDfile
Find this compound or compounds like it in BindingDB:
Activity Spreadsheet -- Enzyme Inhibition Constant Data from BindingDB
Found 1 hit for monomerid = 50548268
TargetCystathionine gamma-lyase(Homo sapiens (Human))
Shanghai Jiao Tong University
Curated by ChEMBL
LigandPNGBDBM50548268(CHEMBL4759091)
Affinity DataIC50: <5.00E+4nM. Assay description: Inhibition of human CSE using L-Cys as the substrate by tandem well based HTS assay
Ligand InfoPC cidPC sid
In DepthDetails ArticlePubMed