BDBM50548351 CHEMBL4786316
SMILES CNC(=O)c1nn(C)c2ccc(Nc3nccc(n3)-n3cc(CN(C)C)cn3)cc12
InChI Key InChIKey=LSASLBFVFUJZOD-UHFFFAOYSA-N
Data  2 IC50  1 Kd
  Tab Delimited (TSV)   2D SDfile   Computed 3D by Vconf -m prep SDfile
Find this compound or compounds like it in BindingDB:
Activity Spreadsheet -- Enzyme Inhibition Constant Data from BindingDB
Found 3 hits for monomerid = 50548351
TargetTyrosine-protein kinase SYK(Homo sapiens (Human))
Astrazeneca
Curated by ChEMBL
LigandPNGBDBM50548351(CHEMBL4786316)
Affinity DataIC50:  0.210nM. Assay description: Inhibition of recombinant full length SYK (unknown origin) by biochemical Omnia assay
Ligand InfoPC cidPC sid
In DepthDetails ArticlePubMed
TargetTyrosine-protein kinase ZAP-70(Homo sapiens (Human))
Astrazeneca
Curated by ChEMBL
LigandPNGBDBM50548351(CHEMBL4786316)
Affinity DataKd:  14nM. Assay description: Binding affinity to ZAP70 (unknown origin)
Ligand InfoPC cidPC sid
In DepthDetails ArticlePubMed
TargetPotassium voltage-gated channel subfamily H member 2(Homo sapiens (Human))
Astrazeneca
Curated by ChEMBL
LigandPNGBDBM50548351(CHEMBL4786316)
Affinity DataIC50:  4.50E+3nM. Assay description: Inhibition of human ERG by plate-based planar patch clamp method
Ligand InfoPC cidPC sid
In DepthDetails ArticlePubMed