BDBM50548685 CHEMBL4776820
SMILES O=c1[nH]c(cc2ncccc12)C1=C[C@@H](CC1)N1CCN(CC1)c1ccc(cc1)C#N
InChI Key InChIKey=IBBZXRLLZKUNIM-HXUWFJFHSA-N
Data  5 IC50
  Tab Delimited (TSV)   2D SDfile   Computed 3D by Vconf -m prep SDfile
Find this compound or compounds like it in BindingDB:
Activity Spreadsheet -- Enzyme Inhibition Constant Data from BindingDB
Found 5 hits for monomerid = 50548685
TargetPoly [ADP-ribose] polymerase 1(Homo sapiens (Human))
Lupin
Curated by ChEMBL
LigandPNGBDBM50548685(CHEMBL4776820)
Affinity DataIC50:  1.10nM. Assay description: Inhibition of N-terminal GST-tagged human full length PARP1 (2 to 1041 residues) expressed in baculovirus infected Sf9 cells using histone mixture (H...
In DepthDetails ArticlePubMed
TargetPoly [ADP-ribose] polymerase 2(Homo sapiens (Human))
Lupin
Curated by ChEMBL
LigandPNGBDBM50548685(CHEMBL4776820)
Affinity DataIC50:  8.10nM. Assay description: Inhibition of N-terminal GST-tagged human PARP2 (2 to 583 residues) expressed in baculovirus infected Sf9 cells using histone mixture (H2A and H2B) a...
In DepthDetails ArticlePubMed
TargetPoly [ADP-ribose] polymerase tankyrase-2(Homo sapiens (Human))
Lupin
Curated by ChEMBL
LigandPNGBDBM50548685(CHEMBL4776820)
Affinity DataIC50:  74nM. Assay description: Inhibition of TNKS2 (unknown origin)
In DepthDetails ArticlePubMed
TargetPoly [ADP-ribose] polymerase tankyrase-1(Homo sapiens (Human))
Lupin
Curated by ChEMBL
LigandPNGBDBM50548685(CHEMBL4776820)
Affinity DataIC50:  769nM. Assay description: Inhibition of TNKS1 (unknown origin)
In DepthDetails ArticlePubMed
TargetProtein mono-ADP-ribosyltransferase PARP3(Homo sapiens (Human))
Lupin
Curated by ChEMBL
LigandPNGBDBM50548685(CHEMBL4776820)
Affinity DataIC50:  8.00E+3nM. Assay description: Inhibition of PARP3 (unknown origin)
In DepthDetails ArticlePubMed