BDBM50550080 CHEMBL4796516
SMILES FC(F)(F)c1cccc(c1)[C@@H]1CC[C@@H](CC1)N1CCN(Cc2ccc(=O)[nH]c2)CC1
InChI Key InChIKey=DMSJDEOGYRYVRN-RVWIWJKTSA-N
Data  1 IC50
PDB links: 1 PDB ID matches this monomer.
  Tab Delimited (TSV)   2D SDfile   Computed 3D by Vconf -m prep SDfile
Find this compound or compounds like it in BindingDB:
Activity Spreadsheet -- Enzyme Inhibition Constant Data from BindingDB
Found 1 hit for monomerid = 50550080
TargetTransient receptor potential cation channel subfamily V member 6(Homo sapiens (Human))
University Of Bern
Curated by ChEMBL
LigandPNGBDBM50550080(CHEMBL4796516)
Affinity DataIC50:  64nM. Assay description: Inhibition of human TRPV6 expressed in HEK293 cells assessed as reduction in Cd2+ influx by calcium-5 fluorescence dye-based FLIPR assay
Ligand InfoPC cidPC sidPDB