BDBM50550084 CHEMBL4789446
SMILES O=C(N1CCN(CC1)[C@H]1CC[C@H](CC1)c1ccccc1)c1ccc(=O)[nH]c1
InChI Key InChIKey=PGIFNFHFONCUJV-PUZFROQSSA-N
Data  1 IC50
  Tab Delimited (TSV)   2D SDfile   Computed 3D by Vconf -m prep SDfile
Find this compound or compounds like it in BindingDB:
Activity Spreadsheet -- Enzyme Inhibition Constant Data from BindingDB
Found 1 hit for monomerid = 50550084
TargetTransient receptor potential cation channel subfamily V member 6(Homo sapiens (Human))
University Of Bern
Curated by ChEMBL
LigandPNGBDBM50550084(CHEMBL4789446)
Affinity DataIC50:  600nM. Assay description: Inhibition of human TRPV6 expressed in HEK293 cells assessed as reduction in Cd2+ influx by calcium-5 fluorescence dye-based FLIPR assay
Ligand InfoPC cidPC sid
In DepthDetails ArticlePubMed