BDBM50550088 CHEMBL4792477
SMILES COc1cc(ccc1O)C(=O)N1CCN(CC1)[C@H]1CC[C@H](CC1)C(C)(C)C
InChI Key InChIKey=AQKVUGBGWJWVFO-HDICACEKSA-N
Data  1 IC50
  Tab Delimited (TSV)   2D SDfile   Computed 3D by Vconf -m prep SDfile
Find this compound or compounds like it in BindingDB:
Activity Spreadsheet -- Enzyme Inhibition Constant Data from BindingDB
Found 1 hit for monomerid = 50550088
TargetTransient receptor potential cation channel subfamily V member 6(Homo sapiens (Human))
University Of Bern
Curated by ChEMBL
LigandPNGBDBM50550088(CHEMBL4792477)
Affinity DataIC50:  2.10E+3nM. Assay description: Inhibition of human TRPV6 expressed in HEK293 cells assessed as reduction in Cd2+ influx by calcium-5 fluorescence dye-based FLIPR assay
Ligand InfoPC cidPC sid
In DepthDetails ArticlePubMed