BDBM50550089 CHEMBL4789968
SMILES COc1cc(CN2CCN(CC2)[C@H]2CC[C@H](CC2)c2ccccc2)ccc1O
InChI Key InChIKey=FXORSHIGJKLRCN-SZPZYZBQSA-N
Data  1 IC50
  Tab Delimited (TSV)   2D SDfile   Computed 3D by Vconf -m prep SDfile
Find this compound or compounds like it in BindingDB:
Activity Spreadsheet -- Enzyme Inhibition Constant Data from BindingDB
Found 1 hit for monomerid = 50550089
TargetTransient receptor potential cation channel subfamily V member 6(Homo sapiens (Human))
University Of Bern
Curated by ChEMBL
LigandPNGBDBM50550089(CHEMBL4789968)
Affinity DataIC50:  1.60E+3nM. Assay description: Inhibition of human TRPV6 expressed in HEK293 cells assessed as reduction in Cd2+ influx by calcium-5 fluorescence dye-based FLIPR assay
Ligand InfoPC cidPC sid
In DepthDetails ArticlePubMed