BDBM50552190 CHEMBL4741714
SMILES C[C@@H]1C[C@H](N)C[C@@H](C1)c1ccccc1NC(=O)c1ccc(F)c(n1)-c1c(F)cccc1F
InChI Key InChIKey=GAPPKQMJLOBLDJ-XHSDSOJGSA-N
Data  3 IC50
  Tab Delimited (TSV)   2D SDfile   Computed 3D by Vconf -m prep SDfile
Find this compound or compounds like it in BindingDB:
Activity Spreadsheet -- Enzyme Inhibition Constant Data from BindingDB
Found 3 hits for monomerid = 50552190
TargetSerine/threonine-protein kinase pim-1(Homo sapiens (Human))
University Of Oxford
Curated by ChEMBL
LigandPNGBDBM50552190(CHEMBL4741714)
Affinity DataIC50:  0.00600nM. Assay description: Inhibition of PIM1 (unknown origin)
Ligand InfoPC cidPC sid
In DepthDetails ArticlePubMed
TargetSerine/threonine-protein kinase pim-3(Homo sapiens (Human))
University Of Oxford
Curated by ChEMBL
LigandPNGBDBM50552190(CHEMBL4741714)
Affinity DataIC50:  0.00900nM. Assay description: Inhibition of PIM3 (unknown origin)
Ligand InfoPC cidPC sid
In DepthDetails ArticlePubMed
TargetSerine/threonine-protein kinase pim-2(Homo sapiens (Human))
University Of Oxford
Curated by ChEMBL
LigandPNGBDBM50552190(CHEMBL4741714)
Affinity DataIC50:  0.0180nM. Assay description: Inhibition of PIM2 (unknown origin)
Ligand InfoPC cidPC sid
In DepthDetails ArticlePubMed