BDBM50553114 CHEMBL4753520
SMILES OC(=O)C(F)(F)F.N\C(NCCC[C@@H](NC(=O)C(c1ccccc1)c1ccccc1)C(=O)NCc1ccc(O)cc1)=N\C(=O)NCCNC(=O)C=C
InChI Key InChIKey=OPLSTFIYKFJAJW-HZPIKELBSA-N
Data  1 KI  1 IC50
  Tab Delimited (TSV)   2D SDfile   Computed 3D by Vconf -m prep SDfile
Find this compound or compounds like it in BindingDB:
Activity Spreadsheet -- Enzyme Inhibition Constant Data from BindingDB
Found 2 hits for monomerid = 50553114
TargetNeuropeptide Y receptor type 1(Homo sapiens (Human))
University Of Regensburg
Curated by ChEMBL
LigandPNGBDBM50553114(CHEMBL4753520)
Affinity DataKi:  0.112nM. Assay description: Displacement of [3H]UR-MK299 from Y1 receptor in human SK-N-MC cells by radioligand binding assay
Ligand InfoPC cidPC sid
In DepthDetails ArticlePubMed
TargetNeuropeptide Y receptor type 1(Homo sapiens (Human))
University Of Regensburg
Curated by ChEMBL
LigandPNGBDBM50553114(CHEMBL4753520)
Affinity DataIC50:  0.186nM. Assay description: Antagonist activity at Y1 receptor in human HEL cells assessed as reduction in pNPY-induced calcium mobilization preincubated for 15 mins followed by...
Ligand InfoPC cidPC sid
In DepthDetails ArticlePubMed