BDBM50553182 CHEMBL4776609
SMILES Cc1ccc(cc1)-n1nc(cc1NC(=O)Nc1ccc(cc1)-n1c(N)c(C(N)=O)c2nc3ccc(NCCCN)cc3nc12)C(C)(C)C
InChI Key InChIKey=PQULHQCNCFPICR-UHFFFAOYSA-N
Data  1 Kd
  Tab Delimited (TSV)   2D SDfile   Computed 3D by Vconf -m prep SDfile
Find this compound or compounds like it in BindingDB:
Activity Spreadsheet -- Enzyme Inhibition Constant Data from BindingDB
Found 1 hit for monomerid = 50553182
TargetTyrosine-protein kinase ABL2(Homo sapiens (Human))
University Of Zurich
Curated by ChEMBL
LigandPNGBDBM50553182(CHEMBL4776609)
Affinity DataKd:  26nM. Assay description: Inhibition of wild-type human ABL2 (A248 to G542 residues) expressed in bacterial expression system by Kinomescan method
Ligand InfoPC cidPC sid
In DepthDetails ArticlePubMed