BDBM50553488 CHEMBL4743691
SMILES COc1cc(F)ccc1-c1ncnc(Nc2cccc(CS(N)(=O)=O)c2)n1
InChI Key InChIKey=MGCPJSMHKDVTGW-UHFFFAOYSA-N
Data  6 IC50
  Tab Delimited (TSV)   2D SDfile   Computed 3D by Vconf -m prep SDfile
Find this compound or compounds like it in BindingDB:
Activity Spreadsheet -- Enzyme Inhibition Constant Data from BindingDB
Found 6 hits for monomerid = 50553488
TargetCyclin-T1/Cyclin-dependent kinase 9(Homo sapiens (Human))
Endotherm
Curated by ChEMBL
LigandPNGBDBM50553488(CHEMBL4743691)
Affinity DataIC50:  11nM. Assay description: Inhibition of recombinant full length His-tagged human CDK9/cyclin T1 expressed in baculovirus expression system using biotinylated peptide biotin-Tt...
Ligand InfoPC cidPC sid
In DepthDetails ArticlePubMed
TargetCyclin-dependent kinase 2/G1/S-specific cyclin-E1(Homo sapiens (Human))
Endotherm
Curated by ChEMBL
LigandPNGBDBM50553488(CHEMBL4743691)
Affinity DataIC50:  1.08E+3nM. Assay description: Inhibition of recombinant GST-tagged human CDK2/GST-tagged cyclin E expressed in sf9 cells using biotinylated peptide biotin-Ttds-YISPLKSPYKISEG as s...
Ligand InfoPC cidPC sid
In DepthDetails ArticlePubMed
LigandPNGBDBM50553488(CHEMBL4743691)
Affinity DataIC50:  1.08E+3nM. Assay description: Effective concentration required for inhibitory activity towards human beta-1 adrenergic receptor
Ligand InfoPC cidPC sid
In DepthDetails PubMed
TargetCyclin-dependent kinase 2/G1/S-specific cyclin-E1(Homo sapiens (Human))
Endotherm
Curated by ChEMBL
LigandPNGBDBM50553488(CHEMBL4743691)
Affinity DataIC50:  1.08E+3nM. Assay description: Inhibition of His-tagged human CDK2/cyclin E1 expressed in insect cells using biotin Ttds-YISPLKSPYKISEG as substrate preincubated for 15 mins follow...
Ligand InfoPC cidPC sid
In DepthDetails ArticlePubMed
LigandPNGBDBM50553488(CHEMBL4743691)
Affinity DataIC50:  11nM. Assay description: Effective concentration required for inhibitory activity towards human beta-1 adrenergic receptor
Ligand InfoPC cidPC sid
In DepthDetails PubMed
TargetCyclin-T1/Cyclin-dependent kinase 9(Homo sapiens (Human))
Endotherm
Curated by ChEMBL
LigandPNGBDBM50553488(CHEMBL4743691)
Affinity DataIC50:  11nM. Assay description: Inhibition of His-tagged human CDK9/cyclin T1 expressed in insect cells using biotin Ttds-YISPLKSPYKISEG as substrate preincubated for 15 mins follow...
Ligand InfoPC cidPC sid
In DepthDetails ArticlePubMed