BDBM50553769 CHEMBL4798887
SMILES CC(C)C[C@H](NC(=O)[C@@H](NC(=O)[C@H](Cc1c(C)cc(O)cc1C)NC(=O)[C@@H]1CCCN1C(=O)[C@H](CCCNC(N)=N)NC(=O)[C@H](CCCNC(N)=N)NC(=O)CCN1Cc2ccccc2C[C@H](NC(=O)[C@@H](CCCNC(N)=N)NC(=O)[C@@H](N)Cc2c(C)cc(O)cc2C)C1=O)C(C)(C)C)C(O)=O
InChI Key InChIKey=CQDUQLAFKFLQTQ-QRURJPQPSA-N
Data  5 KI  5 EC50
  Tab Delimited (TSV)   2D SDfile   Computed 3D by Vconf -m prep SDfile
Find this compound or compounds like it in BindingDB:
Activity Spreadsheet -- Enzyme Inhibition Constant Data from BindingDB
Found 10 hits for monomerid = 50553769
TargetNeurotensin receptor type 2(Homo sapiens (Human))
Vrije Universiteit Brussel
Curated by ChEMBL
LigandPNGBDBM50553769(CHEMBL4798887)
Affinity DataKi:  0.0300nM. Assay description: Displacement of [125I]-neurotensin from human recombinant NTS2 stably expressed in human 1321N1 cell membranes incubated for 60 mins by gamma counter...
Ligand InfoPC cidPC sid
In DepthDetails ArticlePubMed
TargetNeurotensin receptor type 1(Homo sapiens (Human))
Vrije Universiteit Brussel
Curated by ChEMBL
LigandPNGBDBM50553769(CHEMBL4798887)
Affinity DataKi:  0.780nM. Assay description: Displacement of [125I]-neurotensin from human recombinant NTS1 stably expressed in CHO-K1 cell membranes incubated for 60 mins by gamma counter metho...
Ligand InfoPC cidPC sid
In DepthDetails ArticlePubMed
TargetMu-type opioid receptor(Homo sapiens (Human))
Vrije Universiteit Brussel
Curated by ChEMBL
LigandPNGBDBM50553769(CHEMBL4798887)
Affinity DataKi:  1.10nM. Assay description: Displacement of [3H]-DAMGO from recombinant human mu opioid receptor expressed in CHO cell membrane incubated for 60 mins by liquid scintillation cou...
Ligand InfoPC cidPC sid
In DepthDetails ArticlePubMed
TargetKappa-type opioid receptor(Homo sapiens (Human))
Vrije Universiteit Brussel
Curated by ChEMBL
LigandPNGBDBM50553769(CHEMBL4798887)
Affinity DataKi:  102nM. Assay description: Displacement of [3H]-U69593 from recombinant human kappa opioid receptor expressed in CHO cell membrane incubated for 60 mins by liquid scintillation...
Ligand InfoPC cidPC sid
In DepthDetails ArticlePubMed
TargetDelta-type opioid receptor(Homo sapiens (Human))
Vrije Universiteit Brussel
Curated by ChEMBL
LigandPNGBDBM50553769(CHEMBL4798887)
Affinity DataKi:  159nM. Assay description: Displacement of [3H]-Diprenorphine from recombinant human delta opioid receptor expressed in CHO cell membrane incubated for 60 mins by liquid scinti...
Ligand InfoPC cidPC sid
In DepthDetails ArticlePubMed
TargetKappa-type opioid receptor(Homo sapiens (Human))
Vrije Universiteit Brussel
Curated by ChEMBL
LigandPNGBDBM50553769(CHEMBL4798887)
Affinity DataEC50:  415nM. Assay description: Agonist activity at human KOR stably expressed in CHO cell membranes assessed as stimulation of [35S]-GTPgammaS binding incubated for 1 hr by liquid ...
Ligand InfoPC cidPC sid
In DepthDetails ArticlePubMed
TargetDelta-type opioid receptor(Homo sapiens (Human))
Vrije Universiteit Brussel
Curated by ChEMBL
LigandPNGBDBM50553769(CHEMBL4798887)
Affinity DataEC50:  313nM. Assay description: Agonist activity at human DOR stably expressed in CHO cell membranes assessed as stimulation of [35S]-GTPgammaS binding incubated for 1 hr by liquid ...
Ligand InfoPC cidPC sid
In DepthDetails ArticlePubMed
TargetMu-type opioid receptor(Homo sapiens (Human))
Vrije Universiteit Brussel
Curated by ChEMBL
LigandPNGBDBM50553769(CHEMBL4798887)
Affinity DataEC50:  1.14E+3nM. Assay description: Agonist activity at human MOR expressed in human U2OS cells assessed as increase in beta arrestin2 recruitment incubated for 90 mins by pathhunter be...
Ligand InfoPC cidPC sid
In DepthDetails ArticlePubMed
TargetNeurotensin receptor type 1(Homo sapiens (Human))
Vrije Universiteit Brussel
Curated by ChEMBL
LigandPNGBDBM50553769(CHEMBL4798887)
Affinity DataEC50:  1.30nM. Assay description: Agonist activity at human NTS1 expressed in HEK293 cells co-expressing Galphaq/RlucII/GFP10-Ggamma1/Gbeta1 assessed as increase in Galphaq activation...
Ligand InfoPC cidPC sid
In DepthDetails ArticlePubMed
TargetMu-type opioid receptor(Homo sapiens (Human))
Vrije Universiteit Brussel
Curated by ChEMBL
LigandPNGBDBM50553769(CHEMBL4798887)
Affinity DataEC50:  9.10nM. Assay description: Agonist activity at human MOR stably expressed in CHO cell membranes assessed as stimulation of [35S]-GTPgammaS binding incubated for 1 hr by liquid ...
Ligand InfoPC cidPC sid
In DepthDetails ArticlePubMed