BDBM50554274 CHEMBL4782910
SMILES COc1cccc(c1)[C@@H](C)n1cnc2ccc(cc2c1=O)-c1cn[nH]c1
InChI Key InChIKey=WDTAOVYOPRSNQC-CYBMUJFWSA-N
Data  1 IC50
  Tab Delimited (TSV)   2D SDfile   Computed 3D by Vconf -m prep SDfile
Find this compound or compounds like it in BindingDB:
Activity Spreadsheet -- Enzyme Inhibition Constant Data from BindingDB
Found 1 hit for monomerid = 50554274
TargetBeta-adrenergic receptor kinase 1(Homo sapiens (Human))
Janssen Research & Development
Curated by ChEMBL
LigandPNGBDBM50554274(CHEMBL4782910)
Affinity DataIC50:  13nM. Assay description: Inhibition of human GRK2 by transcreener assay
Ligand InfoPC cidPC sid
In DepthDetails ArticlePubMed